{"text_format":"1","workbook":"xlsx","n_sheets":4,"sheets":["Summary (NDC1.0)","Credit Checklist","Project Score Result","Pull Down List"],"not_rendered":{"charts":0,"images":0,"macros":1,"external_links":1,"defined_names":2,"comments":0,"pivot_tables":0},"unopened":[],"bounds":{"document_bytes":16777216,"sheet_cells":100000,"rows_first":2000,"rows_last":500,"rows_between":2000,"halvings":0,"cell_chars":16384,"cell_head_chars":4096},"cells_cut":0,"cells_raw":0,"read":"whole","date_system":"1900"}

{"sheet":"Summary (NDC1.0)","index":0,"n_rows":50,"n_cols":10,"rows_kept":50,"cut":false,"hidden":false,"merged":[[13,2,13,8],[0,0,0,9],[2,3,2,8],[4,3,4,8],[6,3,6,8],[7,5,7,8],[53,6,53,8],[17,5,17,7],[18,5,18,7],[25,2,26,8],[32,3,32,8],[38,3,38,8],[50,2,50,8]]}
["BEAM PLUS SUBMISSION SUMMARY (New Data Centres v1.0)"]
[]
[null,"Project Name: "]
[]
[null,"BEAM Plus Project No:"]
[]
[null,"Assessment Tools:"]
[null,"Provisional Assessment (PA) / Final Assessment (FA) : "]
[]
[null,"*Please be reminded that the information below should be tally with the project information fact sheet."]
[]
[null,"1.","Project Description:"]
[]
[null,null,"Please note that the project description will be shown in the assessment report."]
[]
[null,"2.","Site Area:",null,"m²"]
[]
[null,"3.","Number of Tower/Block:"]
[null,null,"(Number of Storey of each Tower/Block:",null,null,null,null,null,")"]
[]
[null,"4.","Approved GBP Submitted:"]
[]
[null,"5.","Master Programme Submitted: "]
[]
[null,"6.","Project Schedule:"]
[null,"ø","For multiple phase in a single PA or FA asssessment, please fill in the earliest start date for date of commencement and the final complete date for the work completion."]
[]
[null,"ø","a) Demolition "]
[null,null,null,"Date of Commencement:",null,null,"(mm/yyyy)"]
[null,null,null,"Date of Work Completeion:",null,null,"(mm/yyyy)"]
[null,null,null,"Consent for the commencement and carrying out of work submitted"]
[null,null,null,"Demolition is not applicable for the project."]
[null,null,null,"Please fill in with a brief reason of not applicable."]
[null,"ø","b) Foundation"]
[null,null,null,"Date of Commencement:",null,null,"(mm/yyyy)"]
[null,null,null,"Date of Work Completeion:",null,null,"(mm/yyyy)"]
[null,null,null,"Consent for the commencement and carrying out of work submitted"]
[null,null,null,"Foundation is not applicable for the project."]
[null,null,null,"Please fill in with a brief reason of not applicable."]
[null,"ø","c) Super-Structure / Construction"]
{"$rows_left_out":11}
{"sheet":"Credit Checklist","index":1,"n_rows":195,"n_cols":8,"rows_kept":195,"cut":false,"hidden":false,"merged":[[142,6,142,7],[178,0,179,0],[178,1,179,1],[178,3,179,3],[192,6,192,7],[132,6,132,7],[185,6,185,7],[186,5,186,7],[187,5,187,7],[188,5,188,6],[189,5,189,7],[177,6,177,7],[178,6,178,7],[174,6,174,7],[175,6,175,7],[176,6,176,7],[168,6,168,7],[170,6,170,7],[171,6,171,7],[163,6,163,7],[164,6,164,7],[134,6,134,7],[157,6,157,7],[174,0,176,0],[174,1,176,1],[168,0,169,0],[168,1,169,1],[168,3,169,3],[170,0,172,0],[170,1,172,1],[174,3,176,3],[173,2,173,7],[180,6,180,7],[182,0,183,0],[182,1,183,1],[182,3,183,3],[182,6,182,7],[183,6,183,7],[191,6,191,7],[181,6,181,7],[180,0,181,0],[180,1,181,1],[180,3,181,3],[184,2,184,7],[146,0,147,0],[146,1,147,1],[146,3,147,3],[170,3,172,3],[154,1,156,1],[154,3,156,3],[151,0,152,0],[151,1,152,1],[161,5,161,7],[149,6,149,7],[151,6,151,7],[153,6,153,7],[154,6,154,7],[155,6,155,7],[148,2,148,7],[150,6,150,7],[151,3,152,3],[158,5,158,7],[159,5,159,7],[160,5,160,6],[165,6,165,7],[146,6,146,7],[140,4,141,4],[133,0,134,0],[133,1,134,1],[133,3,134,3],[133,6,133,7],[140,5,141,5],[140,6,141,7],[135,5,135,7],[136,5,136,7],[137,5,137,6],[138,5,138,7],[140,0,141,0],[140,1,141,1],[140,2,141,2],[140,3,141,3],[119,1,120,1],[119,0,120,0],[123,6,123,7],[129,6,129,7],[130,6,130,7],[129,1,130,1],[129,0,130,0],[122,0,124,0],[122,1,124,1],[122,3,124,3],[122,6,122,7],[121,2,121,7],[125,3,126,3],[111,5,111,7],[112,5,112,6],[113,5,113,7],[115,6,115,7],[116,6,116,7],[117,6,117,7],[118,6,118,7],[119,6,119,7],[119,3,120,3],[110,5,110,7],[100,3,102,3],[100,6,100,7],[103,6,103,7],[96,0,97,0],[96,1,97,1],[96,3,97,3],[96,6,96,7],[97,6,97,7],[98,6,98,7],[109,6,109,7],[98,1,99,1],[98,0,99,0],[100,1,102,1],[100,0,102,0],[104,2,104,7],[105,6,105,7],[106,6,106,7],[105,1,108,1],[105,0,108,0],[98,3,99,3],[73,0,74,0],[73,1,74,1],[75,0,76,0],[75,1,76,1],[75,3,76,3],[75,6,75,7],[73,3,74,3],[77,3,78,3],[85,6,85,7],[82,5,82,7],[84,6,84,7],[77,0,78,0],[77,1,78,1],[79,5,79,7],[80,5,80,7],[81,5,81,6],[66,6,66,7],[51,2,51,7],[57,6,57,7],[58,2,58,7],[59,6,59,7],[69,6,69,7],[70,6,70,7],[72,6,72,7],[62,0,63,0],[62,1,63,1],[64,0,71,0],[64,1,71,1],[64,6,64,7],[65,6,65,7],[65,3,71,3],[21,3,26,3],[21,1,26,1],[21,0,26,0],[29,3,30,3],[27,3,28,3],[60,6,60,7],[61,6,61,7],[49,6,49,7],[50,6,50,7],[44,5,44,7],[45,5,45,7],[46,5,46,6],[47,5,47,7],[37,6,37,7],[27,0,30,0],[27,1,30,1],[27,6,27,7],[29,6,29,7],[32,2,32,7],[39,3,41,3],[39,1,41,1],[39,0,41,0],[2,6,2,7],[3,6,3,7],[4,6,4,7],[16,6,16,7],[17,0,19,0],[17,1,19,1],[17,3,19,3],[17,6,17,7],[18,6,18,7],[19,6,19,7],[5,6,5,7],[9,3,11,3],[9,1,11,1],[9,0,11,0],[12,0,15,0],[12,1,15,1],[12,3,15,3],[12,6,12,7],[13,6,13,7],[14,6,14,7],[15,6,15,7],[6,6,6,7],[7,0,8,0],[7,1,8,1],[7,3,8,3],[7,6,7,7],[20,6,20,7],[22,6,22,7],[23,6,23,7],[52,1,56,1],[52,0,56,0],[52,3,56,3],[53,6,53,7],[52,6,52,7],[42,6,42,7],[42,3,43,3],[42,1,43,1],[42,0,43,0],[26,6,26,7],[25,6,25,7],[21,6,21,7],[39,6,39,7],[31,6,31,7],[33,6,33,7],[34,6,34,7],[37,0,38,0],[37,1,38,1],[37,3,38,3],[86,6,86,7],[90,2,90,7],[88,2,88,7],[89,2,89,7],[91,0,92,0],[91,1,92,1],[131,6,131,7],[144,6,144,7],[143,2,143,7],[144,3,145,3],[144,1,145,1],[144,0,145,0],[125,6,125,7],[126,6,126,7],[125,1,126,1],[125,0,126,0],[127,2,127,7],[128,2,128,7],[91,3,92,3],[91,6,91,7],[93,0,95,0],[93,1,95,1],[93,3,95,3],[93,6,93,7]]}
["2. Credit Summary"]
[]
[null,"Section","Credit Requirement","Extent of Application","Credit Attainable","Credit Applicable","Credit Anticipated"]
["Integrated Design & Construction Management (IDCM)",null,null,null,"22+16B","Y/N?"]
["IDCM-00-P1 ","Sustainability Champions - Project","Prerequisite achieved for demonstrating that an accredited BEAM Professional (BEAM Pro) with a valid credential for BEAM Plus New Data Centres is engaged as the Project BEAM Pro of the consultant team. ","All DC","Required","Y","Required"]
["IDCM-00-P2","Environmental Management Plan ","Prerequisite achieved for demonstrating that an Environmental Management Plan has been properly prepared.","All DC","Required","Y","Required"]
["IDCM-00-P3","Timber Used for Temporary Works","Prerequisite achieved for demonstrating that no virgin forest products are used for temporary works.","All DC","Required","Y","Required"]
["IDCM-01-01","Sustainability Champions - Design","1 credit point for at least 2 members from at least 2 applicable core design disciplines shall be accredited BEAM Professionals with valid credentials for BEAM Plus New Data Centres.","All DC",1,"Y",0]
[null,null,"1 additional Bonus credit point for at least 1 additional member, from an applicable core design discipline different from the disciplines counted in the above credit, shall be an accredited BEAM Professional with valid credentials for BEAM Plus New Data Centres.\n\nAlternatively,\n\n1 additional Bonus credit point for at least 2 additional members, from an applicable core design discipline different from the disciplines counted in the above credit, shall be accredited BEAM Affiliates.",null,"1B","Y",0,"B"]
["IDCM-01-02","Complimentary Certification","(a) BEAM Plus Neighbourhood (ND)\n\n1 Bonus credit point where the project is certified by BEAM Plus Neighbourhood (ND) certification.","All DC","1B","Y",0,"B"]
[null,null,"(b) BEAM Plus Interiros (BI)\n\n1 Bonus credit point for preparing the Project for BEAM Plus Interiors (BI) certification.",null,"1B","Y",0,"B"]
[null,null,"(c) BEAM Plus Existing Data Centres (EDC)\n\n1 Bonus credit point for preparing the Project for BEAM Plus Existing Data Centres (EDC) certification.",null,"1B","Y",0,"B"]
["IDCM-01-03","Integrated Design Process","(a) Early Considerations for Integrated Building Design\n\n1 credit point for consideration of the integrated design process regarding whole-system thinking to explore the interrelationships among green building design strategies and systems in the conceptual design stage.","All DC",1,"Y",0]
[null,null,"1 credit point for organising at least one multi-disciplinary design charrette to formulate passive and active design strategies in the conceptual/ schematic design stage.",null,1,"Y",0]
[null,null,"(b) Early Design Consideration of Buildability/ Constructability\n\n1 credit point for early design consideration of buildability to ease construction and save on-site materials/ labour before completion of the design development stage.",null,1,"Y",0]
[null,null,"(c) Design Consideration for Operation and Maintenance\n\n1 credit point for design consideration of the long-term operation and maintenance needs of the DC and its engineering services.",null,1,"Y",0]
["IDCM-01-04","Life Cycle Costing","1 credit point for conducting life cycle costing for active systems.","All DC",1,"Y",0]
["IDCM-01-05","Commissioning","2 credit points for demonstrating (a) the appointment of commissioning authority (CxA) before tender stage and (b) providing a commissioning plan.","All DC",2,"Y",0]
[null,null,"1 credit point for providing a commissioning review report before construction as described in part (c).",null,1,"Y",0]
[null,null,"1 credit point for providing commissioning reports as described in part (d).",null,1,"Y",0]
["IDCM-02-01","Sustainability Champions - Construction","1 credit point for at least 2 accredited BEAM Professionals with valid credential for BEAM Plus New Data Centres, are engaged by the main/ lead contractor of the project.\n\nAlternatively,\n\n1 credit point for at least 1 accredited BEAM Professional with valid credential for BEAM Plus New Data Centres and 2 accredited BEAM Affiliates, are engaged by the main/ lead contractor of the project. ","All DC",1,"Y",0]
["IDCM-02-02","Measures to Reduce Site Emissions","For whole building DC developments\n\n(a) Minimisation of Air Pollution\n\n1 credit point for providing adequate monitoring and mitigation measures to minimise air pollution during construction (demolition and foundation are included, if any).","All DC",1,"Y",0]
[null,null,"(b) Minimisation of Noise Pollution\n\n1 credit point for providing adequate monitoring and mitigation measures to minimise noise pollution during construction (demolition and foundation are included, if any).",null,1,"Y",0]
[null,null,"(c) Minimisation of Water Pollution\n\n1 credit point for providing adequate monitoring and mitigation measures to minimise water pollution during construction (demolition and foundation are included, if any).",null,1,"Y",0]
[null,null,"(d) Minimisation of Light Pollution\n\n1 Bonus credit point for providing adequate monitoring and mitigation measures to minimise light pollution during construction (demolition and foundation are included, if any).",null,"1B","Y",0,"B"]
[null,null,"For DC developments located in part of building\n\n(a) Minimisation of Construction Dust\n\n1 credit point for providing adequate monitoring and mitigation measures to minimise air pollution to host building users and neighbouring occupants during construction and fit-out activities.",null,1,"Y",0]
[null,null,"(b) Minimisation of Construction Noise\n\n1 credit point for providing adequate monitoring and mitigation measures to minimise noise pollution to host building users and neighbouring occupants during construction and fit-out activities.",null,1,"Y",0]
["IDCM-02-03","Construction and Demolition Waste Recycling","(a) Demolition Waste Recycling\n\n1 credit point for demonstrating compliance with the Waste Management Plan and the application of proactive waste management provisions during demolition; and recycling at least 15% of demolition waste.","All DC requiring demolition which are under the Applicant’s control",1,"Y",0]
[null,null,"1 to 2 additional Bonus credit points for recycling at least 30% or 60% of demolition waste.",null,"2B","Y",0,"B"]
[null,null,"(b) Construction Waste Recycling\n\n1 credit point for demonstrating compliance with the Waste Management Plan and the application of proactive waste management provisions during construction (foundation to be included, if any); and recycling at least 15% of construction waste (foundation waste to be included, if any).","All DC",1,"Y",0]
[null,null,"1 to 2 additional Bonus credit points for recycling at least 30% or 60% of construction waste (foundation waste to be included, if any).",null,"2B","Y",0,"B"]
["IDCM-02-04","Construction IAQ Management","1 credit point for implementing a Construction IAQ Management Plan, undertaking a building ‘flush out’ or ‘bake out’, and replacement of all filters prior to occupancy.","All DC\n",1,"Y",0]
["IDCM-02-05","Considerate Construction","This credit head is not applicable under BEAM Plus NDC."]
["IDCM-02-06","Building Management Manuals","1 credit point for providing a fully documented Operations and Maintenance Manual and Energy Management Manual.","All DC",1,"Y",0]
["IDCM-02-07","Operator Training plus Chemical Storage and Mixing Room","1 credit point for providing training for operations and maintenance staff to the minimum specified; and demonstrating that adequate maintenance facilities are provided for chemical storage and mixing.","All DC",1,"Y",0]
["IDCM-03-01","Digital Facility Management Interface","1 Bonus credit point for providing a digital interface in addition to the project design metering provision for future DC facility management team to review the building operation performance.","All DC\n","1B","Y",0,"B"]
["IDCM-03-02","Occupant Engagement Platform","1 Bonus credit point for providing a digital platform to engage building occupants.","All DC","1B","Y",0,"B"]
["IDCM-03-03","Document Management System","(a) Project Team Document Management \n\n1 credit point for demonstrating the use of document management systems within the design team.","All DC",1,"Y",0]
[null,null,"(b) Facility Management Team Document Management \n\n1 additional Bonus credit point for demonstrating the use of document management platform by the DC owner or DC management company.",null,"1B","Y",0,"B"]
["IDCM-03-04","BIM Integration","(a) Coordinated Use of BIM with Design Teams and Construction Teams\n\n1 credit point for the coordinated use of BIM among the design team.","All DC",1,"Y",0]
{"$rows_left_out":156}
{"sheet":"Project Score Result","index":2,"n_rows":12,"n_cols":6,"rows_kept":12,"cut":false,"hidden":false,"merged":[[10,0,10,4],[11,0,11,4]]}
[]
[]
["Category","Applicable Credits \n(A)","Achieved Credits \n(B)","% of Achieved Credit \n(C)","Category Weighting \n(D)","Weighted Achieved Score \n(E)"]
[{"$f":"'[1]Credit Checklist'!A5","v":"Integrated Design & Construction Management (IDCM)"},{"$f":"'Credit Checklist'!F45","v":24},{"$f":"IF('Credit Checklist'!F46=\" \",\" \",'Credit Checklist'!F46&\"+\"&'Credit Checklist'!F47&\"B\")","v":"0+0B"},{"$f":"'Credit Checklist'!F48","v":0},0.2,{"$f":"D4*E4","v":0}]
[{"$f":"'[1]Credit Checklist'!A54","v":"Sustainable Site (SS)"},{"$f":"'Credit Checklist'!F80","v":13},{"$f":"IF('Credit Checklist'!F81=\" \",\" \",'Credit Checklist'!F81&\"+\"&'Credit Checklist'!F82&\"B\")","v":"0+0B"},{"$f":"'Credit Checklist'!F83","v":0},0.1,{"$f":"D5*E5","v":0}]
[{"$f":"'[1]Credit Checklist'!A99","v":"Materials and Waste (MW)"},{"$f":"'Credit Checklist'!F111","v":12},{"$f":"IF('Credit Checklist'!F112=\" \",\" \",'Credit Checklist'!F112&\"+\"&'Credit Checklist'!F113&\"B\")","v":"0+0B"},{"$f":"'Credit Checklist'!F114","v":0},0.1,0]
[{"$f":"'[1]Credit Checklist'!A140","v":"Energy Use (EU)"},{"$f":"'Credit Checklist'!F136","v":35},{"$f":"IF('Credit Checklist'!F137=\" \",\" \",'Credit Checklist'!F137&\"+\"&'Credit Checklist'!F138&\"B\")","v":"0+0B"},{"$f":"'Credit Checklist'!F139","v":0},0.4,0]
[{"$f":"'[1]Credit Checklist'!A164","v":"Water Use (WU)"},{"$f":"'Credit Checklist'!F159","v":12},{"$f":"IF('Credit Checklist'!F160=\" \",\" \",'Credit Checklist'!F160&\"+\"&'Credit Checklist'!F161&\"B\")","v":"0+0B"},{"$f":"'Credit Checklist'!F162","v":0},0.1,0]
[{"$f":"'[1]Credit Checklist'!A185","v":"Health and Wellbeing (HWB)"},{"$f":"'Credit Checklist'!F187","v":15},{"$f":"IF('Credit Checklist'!F188=\" \",\" \",'Credit Checklist'!F188&\"+\"&'Credit Checklist'!F189&\"B\")","v":"0+0B"},{"$f":"'Credit Checklist'!F190","v":0},0.1,0]
[{"$f":"'[1]Credit Checklist'!A219","v":"Innovations and Additions (IA)"},null,{"$f":"'Credit Checklist'!G194&\"B\"","v":"0B"},null,null,{"$f":"IF('Credit Checklist'!G194=\" \", \" \", 'Credit Checklist'!G194/100)","v":0}]
["Overall Score",null,null,null,null,{"$f":"IF(SUM(F4:F10)=0, \"\", SUM(F4:F10))","v":""}]
["Overall Rating",null,null,null,null,{"$f":"IF(AND(D7>=0.7,F11>=0.75),\"Platinum\",IF(AND(D7>=0.6,F11>=0.65),\"Gold\",IF(AND(D7>=0.5,F11>=0.55),\"Silver\",IF(AND(D7>=0.4,F11>=0.4),\"Bronze\",IF(F11=\"\",\"\",\"Prerequisite Achieved\")))))","v":""}]

{"sheet":"Pull Down List","index":3,"n_rows":19,"n_cols":42,"rows_kept":19,"cut":false,"hidden":true,"merged":[]}
["Defined Names","areat","ac","area","yn","prereq","prereq_b","sco_1","sco_1_b","sco_2","sco_2_b","sco_3","sco_3_b","sco_5","sco_5_b","sco_15","sco_15_b","sco_bon","sco_bon_b","sco_6","sco_6_b",null,"sco_1_a","sco_2_a","sco_3_a","sco_5_a","sco_15_a",0,null,"Assessment Tools",null,"project type",null,"rank",null,null,null,null,null,"If"]
[null,"Carpark ","Central A/C","Area A",null,"PR","PR","NA","NA","NA","NA","NA","NA","NA","NA","NA","NA","NA","NA","NA","NA",null,"NA","NA","NA","NA","NA","NA",null,null,null,null,null,{"$f":"'Summary (NDC1.0)'!F29","v":"00:00:00"},{"$f":"'Summary (NDC1.0)'!F30","v":"00:00:00"},{"$f":"RANK(AH2,$AH$2:$AI$4)","v":1},{"$f":"RANK(AI2,$AH$2:$AI$4)","v":1},{"$f":"AJ2-AK2","v":0},null,{"$f":"'Summary (NDC1.0)'!#REF!","v":{"$error":"#REF!"}},{"$f":"'Summary (NDC1.0)'!#REF!","v":{"$error":"#REF!"}},{"$f":"IF(AND(AN2<>0,AO2>AN2),1,0)","v":{"$error":"#REF!"}}]
[null,"Clubhouse ","Chiller","Area B","Yes","NA","NA","NS","NS","NS","NS","NS","NS","NS","NS","NS","NS","NS","NS","NS","NS",null,1,2,3,5,15,6,null,"New Data Centers Version 1.0",null,"Provisional Assessment (PA)",null,{"$f":"'Summary (NDC1.0)'!F35","v":"00:00:00"},{"$f":"'Summary (NDC1.0)'!F36","v":"00:00:00"},1,1,{"$f":"AJ3-AK3","v":0},null,{"$f":"'Summary (NDC1.0)'!#REF!","v":{"$error":"#REF!"}},{"$f":"'Summary (NDC1.0)'!#REF!","v":{"$error":"#REF!"}},{"$f":"IF(AND(AN3<>0,AO3>AN3),1,0)","v":{"$error":"#REF!"}}]
[null,"Educational","Mechnical Vent","Area C","No",null,0,1,1,2,2,3,3,5,5,15,15,"1B","1B",6,6,null,null,1,2,4,14,5,null,null,null,"Final Assessment (FA)",null,{"$f":"'Summary (NDC1.0)'!F41","v":"00:00:00"},{"$f":"'Summary (NDC1.0)'!F42","v":"00:00:00"},1,1,0,null,{"$f":"'Summary (NDC1.0)'!#REF!","v":{"$error":"#REF!"}},{"$f":"'Summary (NDC1.0)'!#REF!","v":{"$error":"#REF!"}},{"$error":"#REF!"}]
[null,"Hotel","Split Type A/C","Area D",null,null,null,null,0,1,1,2,2,4,4,14,14,null,0,5,5,null,null,null,1,3,13,4,null,null,null,null,null,null,null,null,null,{"$f":"SUM(AL2:AL4)","v":0},null,{"$f":"'Summary (NDC1.0)'!#REF!","v":{"$error":"#REF!"}},{"$f":"'Summary (NDC1.0)'!#REF!","v":{"$error":"#REF!"}},{"$error":"#REF!"}]
[null,"Industrial","VRV",null,null,null,null,null,null,null,0,1,1,3,3,13,13,null,null,4,4,null,null,null,null,2,12,3,null,null,null,null,null,null,null,null,null,null,null,null,null,{"$f":"SUM(AP2:AP5)","v":{"$error":"#REF!"}}]
[null,"Residential","Windows Type A/C",null,null,null,null,null,null,null,null,null,0,2,2,12,12,null,null,3,3,null,null,null,null,1,11,2]
[null,"Retail","VRV & fresh air",null,null,null,null,null,null,null,null,null,null,1,1,11,11,null,null,2,2,null,null,null,null,null,10,1]
[null,null,"To be provided by future tenant",null,null,null,null,null,null,null,null,null,null,null,0,10,10,null,null,1,1,null,null,null,null,null,9]
[null,null,null,null,null,null,null,null,null,null,null,null,null,null,null,9,9,null,null,null,0,null,null,null,null,null,8]
[null,null,null,null,null,null,null,null,null,null,null,null,null,null,null,8,8,null,null,null,null,null,null,null,null,null,7]
[null,null,null,null,null,null,null,null,null,null,null,null,null,null,null,7,7,null,null,null,null,null,null,null,null,null,6]
[null,null,null,null,null,null,null,null,null,null,null,null,null,null,null,6,6,null,null,null,null,null,null,null,null,null,5]
[null,null,null,null,null,null,null,null,null,null,null,null,null,null,null,5,5,null,null,null,null,null,null,null,null,null,4]
[null,null,null,null,null,null,null,null,null,null,null,null,null,null,null,4,4,null,null,null,null,null,null,null,null,null,3]
[null,null,null,null,null,null,null,null,null,null,null,null,null,null,null,3,3,null,null,null,null,null,null,null,null,null,2]
[null,null,null,null,null,null,null,null,null,null,null,null,null,null,null,2,2,null,null,null,null,null,null,null,null,null,1]
[null,null,null,null,null,null,null,null,null,null,null,null,null,null,null,1,1]
[null,null,null,null,null,null,null,null,null,null,null,null,null,null,null,null,0]