{"text_format":"1","workbook":"xlsx","n_sheets":5,"sheets":["Summary (NB2.0)","Credit Checklist","Project Score Result","Target Rating_BSL","pull down list"],"not_rendered":{"charts":0,"images":0,"macros":1,"external_links":0,"defined_names":32,"comments":0,"pivot_tables":0},"unopened":[],"bounds":{"document_bytes":16777216,"sheet_cells":100000,"rows_first":2000,"rows_last":500,"rows_between":2000,"halvings":0,"cell_chars":16384,"cell_head_chars":4096},"cells_cut":0,"cells_raw":0,"read":"whole","date_system":"1900"}

{"sheet":"Summary (NB2.0)","index":0,"n_rows":56,"n_cols":10,"rows_kept":56,"cut":false,"hidden":false,"merged":[[38,3,38,8],[50,2,50,8],[54,6,56,8],[17,5,17,7],[18,5,18,7],[6,3,6,8],[25,2,26,8],[32,3,32,8],[0,0,0,9],[13,2,13,8],[2,3,2,8],[4,3,4,8],[7,5,7,8]]}
["BEAM PLUS SUBMISSION SUMMARY (NEW BUILDINGS V2.0)"]
[]
[null,"Project Name: "]
[]
[null,"BEAM Plus Project No:"]
[]
[null,"Assessment Tools:"]
[null,"Provisional Assessment (PA) / Final Assessment (FA) : "]
[]
[null,"*Please be reminded that the information below should be tally with the project information fact sheet."]
[]
[null,"1.","Project Description:"]
[]
[null,null,"Please note that the project description will be shown in the assessment report."]
[]
[null,"2.","Site Area:",null,"m²"]
[]
[null,"3.","Number of Tower/Block:"]
[null,null,"(Number of Storey of each Tower/Block:",null,null,null,null,null,")"]
[]
{"$rows_left_out":37}
{"sheet":"Credit Checklist","index":1,"n_rows":221,"n_cols":14,"rows_kept":221,"cut":false,"hidden":false,"merged":[[2,8,2,12],[2,13,3,13],[4,6,4,7],[5,6,5,7],[6,6,6,7],[2,0,3,0],[2,1,3,1],[2,2,3,2],[2,3,3,3],[2,4,3,4],[2,5,3,5],[7,6,7,7],[8,0,9,0],[8,1,9,1],[8,3,9,3],[8,6,8,7],[10,0,12,0],[10,1,12,1],[10,3,12,3],[2,6,3,7],[17,6,17,7],[18,0,20,0],[18,1,20,1],[18,3,20,3],[18,6,18,7],[19,6,19,7],[20,6,20,7],[13,0,16,0],[13,1,16,1],[13,3,16,3],[13,6,13,7],[14,6,14,7],[15,6,15,7],[16,6,16,7],[26,0,31,0],[26,1,31,1],[26,3,28,3],[26,6,26,7],[29,3,31,3],[29,6,29,7],[21,6,21,7],[22,0,25,0],[22,1,25,1],[22,3,25,3],[22,6,22,7],[23,6,23,7],[24,6,24,7],[25,6,25,7],[40,0,43,0],[40,1,43,1],[40,3,43,3],[40,6,40,7],[44,0,45,0],[44,1,45,1],[44,3,45,3],[44,6,44,7],[32,6,32,7],[33,6,33,7],[34,6,34,7],[35,6,35,7],[38,0,39,0],[38,1,39,1],[38,3,39,3],[38,6,38,7],[39,6,39,7],[46,5,46,7],[47,5,47,7],[48,5,48,6],[49,5,49,7],[51,0,52,0],[51,1,52,1],[51,2,52,2],[51,3,52,3],[51,4,52,4],[51,5,52,5],[51,6,52,7],[51,8,51,12],[51,13,52,13],[53,6,53,7],[54,6,54,7],[55,0,59,0],[55,1,59,1],[55,3,59,3],[55,6,55,7],[56,6,56,7],[65,6,65,7],[66,6,66,7],[67,0,68,0],[67,1,68,1],[67,3,68,3],[67,6,67,7],[68,6,68,7],[60,0,61,0],[60,1,61,1],[60,3,61,3],[60,6,60,7],[61,6,61,7],[62,0,64,0],[62,1,64,1],[62,3,64,3],[62,6,62,7],[77,6,77,7],[79,3,80,3],[81,3,82,3],[81,6,81,7],[82,6,82,7],[84,6,84,7],[69,0,74,0],[69,1,74,1],[69,3,71,3],[69,6,69,7],[72,3,74,3],[75,0,83,0],[75,1,83,1],[75,6,75,7],[76,3,78,3],[76,6,76,7],[89,0,90,0],[89,1,90,1],[89,3,90,3],[91,5,91,7],[92,5,92,7],[93,5,93,6],[85,0,86,0],[85,1,86,1],[85,6,85,7],[86,6,86,7],[87,0,88,0],[87,1,88,1],[87,3,88,3],[87,6,87,7],[96,8,96,12],[96,13,97,13],[98,6,98,7],[99,6,99,7],[101,0,102,0],[101,1,102,1],[101,3,102,3],[101,6,101,7],[94,5,94,7],[96,0,97,0],[96,1,97,1],[96,2,97,2],[96,3,97,3],[96,4,97,4],[96,5,97,5],[96,6,97,7],[110,0,111,0],[110,1,111,1],[110,3,111,3],[110,6,110,7],[112,0,114,0],[112,1,114,1],[112,3,114,3],[112,6,112,7],[103,0,106,0],[103,1,106,1],[103,2,104,2],[103,3,104,3],[103,6,103,7],[107,0,109,0],[107,1,109,1],[107,6,107,7],[115,0,116,0],[115,1,116,1],[115,3,116,3],[115,6,115,7],[116,6,116,7],[117,0,119,0],[117,1,119,1],[117,3,119,3],[117,6,117,7],[128,0,131,0],[128,1,131,1],[128,3,131,3],[128,6,128,7],[129,6,129,7],[132,5,132,7],[120,0,124,0],[120,1,124,1],[120,3,124,3],[120,6,120,7],[125,6,125,7],[126,0,127,0],[126,1,127,1],[126,3,127,3],[126,6,126,7],[133,5,133,7],[134,5,134,6],[135,5,135,7],[137,0,138,0],[137,1,138,1],[137,2,138,2],[137,3,138,3],[137,4,138,4],[137,5,138,5],[137,6,138,7],[137,8,137,12],[137,13,138,13],[139,6,139,7],[140,6,140,7],[141,6,141,7],[142,0,143,0],[142,1,143,1],[142,2,143,2],[142,3,143,3],[142,6,142,7],[144,6,144,7],[145,0,147,0],[145,1,147,1],[145,3,147,3],[145,6,145,7],[148,0,150,0],[148,1,150,1],[148,3,150,3],[148,6,148,7],[149,6,149,7],[151,0,152,0],[151,1,152,1],[151,3,152,3],[151,6,151,7],[152,6,152,7],[153,0,154,0],[153,1,154,1],[153,3,154,3],[153,6,153,7],[161,8,161,12],[161,13,162,13],[163,6,163,7],[164,6,164,7],[155,6,155,7],[156,5,156,7],[157,5,157,7],[158,5,158,6],[159,5,159,7],[165,0,166,0],[165,1,166,1],[165,3,166,3],[165,6,165,7],[167,0,168,0],[167,1,168,1],[167,3,168,3],[167,6,167,7],[161,5,162,5],[161,6,162,7],[161,0,162,0],[161,1,162,1],[161,2,162,2],[161,3,162,3],[161,4,162,4],[169,6,169,7],[170,6,170,7],[171,6,171,7],[172,6,172,7],[173,6,173,7],[174,0,176,0],[174,1,176,1],[174,3,176,3],[174,6,174,7],[175,6,175,7],[182,6,183,7],[182,8,182,12],[182,13,183,13],[184,6,184,7],[185,6,185,7],[187,0,188,0],[187,1,188,1],[187,3,188,3],[177,5,177,7],[178,5,178,7],[179,5,179,6],[180,5,180,7],[182,0,183,0],[182,1,183,1],[182,2,183,2],[182,3,183,3],[182,4,183,4],[182,5,183,5],[189,0,190,0],[189,1,190,1],[189,3,190,3],[189,6,189,7],[191,0,194,0],[191,1,194,1],[191,3,194,3],[191,6,191,7],[192,6,192,7],[194,6,194,7],[201,6,201,7],[202,0,204,0],[202,1,204,1],[202,3,203,3],[202,6,202,7],[204,6,204,7],[195,6,195,7],[196,0,200,0],[196,1,200,1],[196,6,196,7],[197,6,197,7],[198,6,198,7],[200,6,200,7],[205,0,206,0],[205,1,206,1],[205,3,206,3],[205,6,205,7],[207,0,208,0],[207,1,208,1],[207,3,208,3],[207,6,207,7],[208,6,208,7],[216,8,216,12],[216,13,217,13],[218,6,218,7],[210,6,210,7],[211,5,211,7],[212,5,212,7],[213,5,213,6],[214,5,214,7],[216,0,217,0],[216,1,217,1],[216,2,217,2],[216,3,217,3],[216,4,217,4],[216,5,217,5],[216,6,217,7]]}
["2. Credit Summary"]
[]
[null,"Section","Credit Requirement","Extent of Application","Credit Attainable","Credit Applicable","Credit Anticipated",null,"Responsible Party/ Discipline",null,null,null,null,"Remarks"]
[]
["Integrated Design & Construction Management (IDCM)",null,null,null,{"$f":"SUM(E6:E46)&\"+\"&COUNTIF(E6:E46,\"1B\")&\"B\"","v":"25+14B"},"Y/N?"]
["IDCM P1","Sustainability Champions - Project","Demonstrate that an accredited BEAM Professional (BEAM Pro) with a valid credential for BEAM Plus New Buildings v2.0 is engaged as the Project BEAM Pro of the consultant team.","All buildings","Required","Y","Required"]
["IDCM P2","Environmental Management Plan","Demonstrate that an Environmental Management Plan (EMP) has been properly prepared.","All buildings","Required","Y","Required"]
["IDCM P3","Timber Used for Temporary Works","Demonstrate that no virgin forest products are used for temporary works.","All buildings","Required","Y","Required"]
["IDCM 1","Sustainability Champions - Design","1 credit for at least two (2) members from at least two (2) applicable core design disciplines shall be accredited BEAM Professionals with valid credentials for BEAM Plus NB v2.0 for Projects intending to achieve Bronze rating or above.","All buildings",1,"Y"]
[null,null,"1 ADDITIONAL BONUS credit for at least one (1) additional member, from an applicable core design discipline different from the disciplines counted in the above credit, shall be accredited BEAM Professional with valid credential for BEAM Plus NB v2.0; \n\nAlternatively, \nAt least two (2) additional members, of an applicable core design discipline different from the disciplines counted in the above credit, shall be accredited BEAM Affiliates with valid credential for BEAM Plus NB v2.0.",null,"1B","Y",null,"B"]
["IDCM 2","Complimentary Certification","(a) BEAM Plus Neighbourhood (ND)\n1 BONUS credit where the project is certified by BEAM Plus Neighbourhood (ND) certification.","All buildings that are applicable for respective BEAM Plus certification tools.","1B","Y",null,"B"]
[null,null,"(b) BEAM Plus Interiors (BI)\n1 BONUS credit for preparing the Project for BEAM Plus Interiors (BI) certification.",null,"1B","Y",null,"B"]
[null,null,"(c) BEAM Plus Existing Buildings (EB) \n1 BONUS credit for preparing the project for BEAM Plus Existing Buildings (EB) certification (comprehensive scheme).",null,"1B","Y",null,"B"]
["IDCM 3","Integrated Design Process","(a) Early Consideration(s) for Integrated Building Design Process\n1 credit for consideration of the integrated design process on whole-systems thinking to explore the interrelationships among green building design strategies and systems in the conceptual design stage.\n","All buildings",1,"Y"]
[null,null,"1 ADDITIONAL credit for organizing at least one multi-disciplinary design charrette to formulate passive and active design strategies in the conceptual/ schematic design stages.",null,1,"Y"]
[null,null,"(b) Early Design Consideration of Buildability/ Constructability\n1 credit for early design consideration of buildability to ease construction and save on-site materials/ labour before completion of the design development stage.\n",null,1,"Y"]
[null,null,"(c) Design Consideration for Operation and Maintenance\n1 credit for design consideration of  the long-term operation and maintenance needs for the building and its engineering services.\n",null,1,"Y"]
["IDCM 4","Life Cycle Costing","1 credit for conducting life cycle costing for active systems.","All buildings",1,"Y"]
["IDCM 5","Commissioning","2 credits for demonstrating the (a) the appointment of commissioning authority (CxA) before tender stage and (b) providing a commissioning plan.","All buildings",2,"Y",0]
[null,null,"1 credit for providing a commissioning review report before construction as described in part ( c)",null,1,"Y",0]
{"$rows_left_out":202}
{"sheet":"Project Score Result","index":2,"n_rows":28,"n_cols":7,"rows_kept":28,"cut":false,"hidden":false,"merged":[[10,0,10,4],[11,0,11,4]]}
[]
[]
["Category","Applicable Credits \n(A)","Achieved Credits \n(B)","% of Achieved Credit \n(C)","Category Weighting \n(D)","Weighted Achieved Score \n(E)","Flat for 10% - 20%"]
[{"$f":"'Credit Checklist'!A5","v":"Integrated Design & Construction Management (IDCM)"},{"$f":"'Credit Checklist'!F47","v":25},{"$f":"IF('Credit Checklist'!F48=\" \",\" \",'Credit Checklist'!F48&\"+\"&'Credit Checklist'!F49&\"B\")","v":"0+0B"},{"$f":"'Credit Checklist'!F50","v":0},0.18,{"$f":"IF(D4=\" \", \" \",D4*E4)","v":0},{"$f":"IF(AND(D4>=20%,D4>=10%),0,1)","v":1}]
[{"$f":"'Credit Checklist'!A54","v":"Sustainable Site (SS)"},{"$f":"'Credit Checklist'!F92","v":21},{"$f":"IF('Credit Checklist'!F93=\" \",\" \",'Credit Checklist'!F93&\"+\"&'Credit Checklist'!F94&\"B\")","v":"0+0B"},{"$f":"'Credit Checklist'!F95","v":0},0.15,0,{"$f":"IF(AND(D5>=20%,D5>=10%),0,1)","v":1}]
[{"$f":"'Credit Checklist'!A99","v":"Materials and Waste (MW)"},{"$f":"'Credit Checklist'!F133","v":14},{"$f":"IF('Credit Checklist'!F134=\" \",\" \",'Credit Checklist'!F134&\"+\"&'Credit Checklist'!F135&\"B\")","v":"0+0B"},{"$f":"'Credit Checklist'!F136","v":0},0.09,0,1]
[{"$f":"'Credit Checklist'!A140","v":"Energy Use (EU)"},{"$f":"'Credit Checklist'!F157","v":31},{"$f":"IF('Credit Checklist'!F158=\" \",\" \",'Credit Checklist'!F158&\"+\"&'Credit Checklist'!F159&\"B\")","v":"0+0B"},{"$f":"'Credit Checklist'!F160","v":0},0.28999999999999998,0,1]
[{"$f":"'Credit Checklist'!A164","v":"Water Use (WU)"},{"$f":"'Credit Checklist'!F178","v":12},{"$f":"IF('Credit Checklist'!F179=\" \",\" \",'Credit Checklist'!F179&\"+\"&'Credit Checklist'!F180&\"B\")","v":"0+0B"},{"$f":"'Credit Checklist'!F181","v":0},7.0000000000000007E-2,0,1]
[{"$f":"'Credit Checklist'!A185","v":"Health and Wellbeing (HWB)"},{"$f":"'Credit Checklist'!F212","v":19},{"$f":"IF('Credit Checklist'!F213=\" \",\" \",'Credit Checklist'!F213&\"+\"&'Credit Checklist'!F214&\"B\")","v":"0+0B"},{"$f":"'Credit Checklist'!F215","v":0},0.22,0,{"$f":"IF(AND(D9>=20%,D9>=10%),0,1)","v":1}]
[{"$f":"'Credit Checklist'!A219","v":"Innovations and Additions (IA)"},null,{"$f":"IF('Credit Checklist'!G220=0, \" \", 'Credit Checklist'!G220)","v":" "},null,null,{"$f":"IF(C10=\" \", \" \", C10/100)","v":" "}]
["Overall Score",null,null,null,null,{"$f":"IF(SUM(F4:F10)=0, \" \", SUM(F4:F10))","v":" "},{"$f":"SUM(G4:G9)","v":6}]
["Overall Rating",null,null,null,null,{"$f":"IF(F11=\" \",\" \",IF(G11>0,\"Prerequisite Achieved\",IF(OR(F11>0.75,F11=0.75),\"Platinum\",IF(OR(F11>0.65,F11=0.65),\"Gold\",IF(OR(F11>0.55,F11=0.55),\"Silver\",IF(OR(F11>0.4,F11=0.4),\"Bronze\",IF(OR(F11>0.2,F11=0.2),\"Prerequisite Achieved\",\"c\")))))))","v":" "}]
[]
[]
[]
[]
[]
[]
[]
[]
{"$rows_left_out":9}
{"sheet":"Target Rating_BSL","index":3,"n_rows":23,"n_cols":12,"rows_kept":23,"cut":false,"hidden":true,"merged":[]}
[null,"Applicant Summary"]
[null,"Category","Applicable Credits","Achieved Credits","% of Achieved Credits","Category Weight Factor","Weighted Achieved Score","Achieved Sub-Rating"]
[null,"Site Aspects",{"$f":"#REF!","v":{"$error":"#REF!"}},{"$f":"#REF!","v":{"$error":"#REF!"}},{"$f":"IF(C3>0,IF(D3>0,(D3/C3),\"NA\"),\"NA\")","v":{"$error":"#REF!"}},0.25,{"$f":"IF(E3<>\"NA\",E3*F3*100,\"NA\")","v":{"$error":"#REF!"}},{"$f":"IF(E3=\"NA\",\"NA\",IF(E3>=0.7,\"Platinum\",IF(E3>=0.6,\"Gold\",IF(E3>=0.5,\"Silver\",IF(E3>=0.4,\"Bronze\",\"Unclassified\")))))","v":{"$error":"#REF!"}},null,null,{"$f":"IF(H3=\"NA\",1,IF(H3=\"Platinum\",5,IF(H3=\"Gold\",4,IF(H3=\"Silver\",3,IF(H3=\"Bronze\",2,1)))))","v":{"$error":"#REF!"}},{"$f":"IF(COUNTIF(#REF!,\"Blank\")>0,\"Blank\",\"OK\")","v":{"$error":"#REF!"}}]
[null,"Materials Aspects",{"$f":"#REF!","v":{"$error":"#REF!"}},{"$f":"#REF!","v":{"$error":"#REF!"}},{"$f":"IF(C4>0,IF(D4>0,(D4/C4),\"NA\"),\"NA\")","v":{"$error":"#REF!"}},0.08,{"$f":"IF(E4<>\"NA\",E4*F4*100,\"NA\")","v":{"$error":"#REF!"}},null,null,null,null,{"$f":"IF(COUNTIF(#REF!,\"Blank\")>0,\"Blank\",\"OK\")","v":{"$error":"#REF!"}}]
[null,"Energy Use",{"$f":"#REF!","v":{"$error":"#REF!"}},{"$f":"#REF!","v":{"$error":"#REF!"}},{"$f":"IF(C5>0,IF(D5>0,(D5/C5),\"NA\"),\"NA\")","v":{"$error":"#REF!"}},0.35,{"$f":"IF(E5<>\"NA\",E5*F5*100,\"NA\")","v":{"$error":"#REF!"}},{"$f":"IF(E5=\"NA\",\"NA\",IF(E5>=0.7,\"Platinum\",IF(E5>=0.6,\"Gold\",IF(E5>=0.5,\"Silver\",IF(E5>=0.4,\"Bronze\",\"Unclassified\")))))","v":{"$error":"#REF!"}},null,null,{"$f":"IF(H5=\"NA\",1,IF(H5=\"Platinum\",5,IF(H5=\"Gold\",4,IF(H5=\"Silver\",3,IF(H5=\"Bronze\",2,1)))))","v":{"$error":"#REF!"}},{"$f":"IF(COUNTIF(#REF!,\"Blank\")>0,\"Blank\",\"OK\")","v":{"$error":"#REF!"}}]
[null,"Water Use",{"$f":"#REF!","v":{"$error":"#REF!"}},{"$f":"#REF!","v":{"$error":"#REF!"}},{"$f":"IF(C6>0,IF(D6>0,(D6/C6),\"NA\"),\"NA\")","v":{"$error":"#REF!"}},0.12,{"$f":"IF(E6<>\"NA\",E6*F6*100,\"NA\")","v":{"$error":"#REF!"}},null,null,null,null,{"$f":"IF(COUNTIF(#REF!,\"Blank\")>0,\"Blank\",\"OK\")","v":{"$error":"#REF!"}}]
[null,"Indoor Environmental Quality",{"$f":"#REF!","v":{"$error":"#REF!"}},{"$f":"#REF!","v":{"$error":"#REF!"}},{"$f":"IF(C7>0,IF(D7>0,(D7/C7),\"NA\"),\"NA\")","v":{"$error":"#REF!"}},0.2,{"$f":"IF(E7<>\"NA\",E7*F7*100,\"NA\")","v":{"$error":"#REF!"}},{"$f":"IF(E7=\"NA\",\"NA\",IF(E7>=0.7,\"Platinum\",IF(E7>=0.6,\"Gold\",IF(E7>=0.5,\"Silver\",IF(E7>=0.4,\"Bronze\",\"Unclassified\")))))","v":{"$error":"#REF!"}},null,null,{"$f":"IF(H7=\"NA\",1,IF(H7=\"Platinum\",5,IF(H7=\"Gold\",4,IF(H7=\"Silver\",3,IF(H7=\"Bronze\",2,1)))))","v":{"$error":"#REF!"}},{"$f":"IF(COUNTIF(#REF!,\"Blank\")>0,\"Blank\",\"OK\")","v":{"$error":"#REF!"}}]
[null,"Innovations and Additions",null,{"$f":"#REF!","v":{"$error":"#REF!"}},null,1,{"$f":"D8","v":{"$error":"#REF!"}},{"$f":"IF(G8=\"\",\"Unclassified\",IF(G8>=3,\"Platinum\",IF(G8>=2,\"Gold\",IF(G8>=1,\"Silver\",IF(G8=0,\"Bronze\",\"Unclassified\")))))","v":{"$error":"#REF!"}},null,null,{"$f":"IF(H8=\"NA\",1,IF(H8=\"Platinum\",5,IF(H8=\"Gold\",4,IF(H8=\"Silver\",3,IF(H8=\"Bronze\",2,1)))))","v":{"$error":"#REF!"}},{"$f":"IF(COUNTIF(L3:L7,\"Blank\")<5,\"OK\",\"Blank\")","v":"OK"}]
[null,null,null,null,null,"Sub Rating",{"$f":"SUM(G3:G8)","v":{"$error":"#REF!"}},{"$f":"IF(G9=0,\"NA\",IF(G9>=75,\"Platinum\",IF(G9>=65,\"Gold\",IF(G9>=55,\"Silver\",IF(G9>=40,\"Bronze\",\"Unclassified\")))))","v":{"$error":"#REF!"}},null,null,{"$f":"IF(H9=\"NA\",1,IF(H9=\"Platinum\",5,IF(H9=\"Gold\",4,IF(H9=\"Silver\",3,IF(H9=\"Bronze\",2,1)))))","v":{"$error":"#REF!"}},{"$f":"IF(COUNTIF(#REF!,\"Blank\")>0,\"Blank\",\"OK\")","v":{"$error":"#REF!"}}]
[null,null,null,null,null,"Overall Rating",{"$f":"+G9","v":{"$error":"#REF!"}},{"$f":"IF(J10<>9,\"Canot be Assessed\",IF(K10=1,\"Unclassified\",IF(K10=2,\"Bronze\",IF(K10=3,\"Silver\",IF(K10=4,\"Gold\",IF(K10=5,\"Platinum\",\"NA\"))))))","v":{"$error":"#REF!"}},null,{"$f":"COUNTIF(#REF!,\"OK\")","v":{"$error":"#REF!"}},{"$f":"MIN(K3:K9)","v":{"$error":"#REF!"}},{"$f":"IF(COUNTIF(L3:L7,\"Blank\")>0,\"Blank\",\"OK\")","v":"OK"}]
[]
[]
[]
[null,"BAS Summary"]
[null,"Category","Applicable Credits","Achieved Credits","% of Achieved Credits","Category Weight Factor","Weighted Achieved Score","Achieved Sub-Rating"]
[null,"Site Aspects",{"$f":"#REF!","v":{"$error":"#REF!"}},{"$f":"#REF!","v":{"$error":"#REF!"}},{"$f":"IF(C16>0,IF(D16>0,(D16/C16),\"NA\"),\"NA\")","v":{"$error":"#REF!"}},0.25,{"$f":"IF(E16<>\"NA\",E16*F16*100,\"NA\")","v":{"$error":"#REF!"}},{"$f":"IF(E16=\"NA\",\"NA\",IF(E16>=0.7,\"Platinum\",IF(E16>=0.6,\"Gold\",IF(E16>=0.5,\"Silver\",IF(E16>=0.4,\"Bronze\",\"Unclassified\")))))","v":{"$error":"#REF!"}},null,null,{"$f":"IF(H16=\"NA\",1,IF(H16=\"Platinum\",5,IF(H16=\"Gold\",4,IF(H16=\"Silver\",3,IF(H16=\"Bronze\",2,1)))))","v":{"$error":"#REF!"}},{"$f":"IF(COUNTIF(#REF!,\"Blank\")>0,\"Blank\",\"OK\")","v":{"$error":"#REF!"}}]
[null,"Materials Aspects",{"$f":"#REF!","v":{"$error":"#REF!"}},{"$f":"#REF!","v":{"$error":"#REF!"}},{"$f":"IF(C17>0,IF(D17>0,(D17/C17),\"NA\"),\"NA\")","v":{"$error":"#REF!"}},0.08,{"$f":"IF(E17<>\"NA\",E17*F17*100,\"NA\")","v":{"$error":"#REF!"}},null,null,null,null,{"$f":"IF(COUNTIF(#REF!,\"Blank\")>0,\"Blank\",\"OK\")","v":{"$error":"#REF!"}}]
[null,"Energy Use",{"$f":"#REF!","v":{"$error":"#REF!"}},{"$f":"#REF!","v":{"$error":"#REF!"}},{"$f":"IF(C18>0,IF(D18>0,(D18/C18),\"NA\"),\"NA\")","v":{"$error":"#REF!"}},0.35,{"$f":"IF(E18<>\"NA\",E18*F18*100,\"NA\")","v":{"$error":"#REF!"}},{"$f":"IF(E18=\"NA\",\"NA\",IF(E18>=0.7,\"Platinum\",IF(E18>=0.6,\"Gold\",IF(E18>=0.5,\"Silver\",IF(E18>=0.4,\"Bronze\",\"Unclassified\")))))","v":{"$error":"#REF!"}},null,null,{"$f":"IF(H18=\"NA\",1,IF(H18=\"Platinum\",5,IF(H18=\"Gold\",4,IF(H18=\"Silver\",3,IF(H18=\"Bronze\",2,1)))))","v":{"$error":"#REF!"}},{"$f":"IF(COUNTIF(#REF!,\"Blank\")>0,\"Blank\",\"OK\")","v":{"$error":"#REF!"}}]
[null,"Water Use",{"$f":"#REF!","v":{"$error":"#REF!"}},{"$f":"#REF!","v":{"$error":"#REF!"}},{"$f":"IF(C19>0,IF(D19>0,(D19/C19),\"NA\"),\"NA\")","v":{"$error":"#REF!"}},0.12,{"$f":"IF(E19<>\"NA\",E19*F19*100,\"NA\")","v":{"$error":"#REF!"}},null,null,null,null,{"$f":"IF(COUNTIF(#REF!,\"Blank\")>0,\"Blank\",\"OK\")","v":{"$error":"#REF!"}}]
[null,"Indoor Environmental Quality",{"$f":"#REF!","v":{"$error":"#REF!"}},{"$f":"#REF!","v":{"$error":"#REF!"}},{"$f":"IF(C20>0,IF(D20>0,(D20/C20),\"NA\"),\"NA\")","v":{"$error":"#REF!"}},0.2,{"$f":"IF(E20<>\"NA\",E20*F20*100,\"NA\")","v":{"$error":"#REF!"}},{"$f":"IF(E20=\"NA\",\"NA\",IF(E20>=0.7,\"Platinum\",IF(E20>=0.6,\"Gold\",IF(E20>=0.5,\"Silver\",IF(E20>=0.4,\"Bronze\",\"Unclassified\")))))","v":{"$error":"#REF!"}},null,null,{"$f":"IF(H20=\"NA\",1,IF(H20=\"Platinum\",5,IF(H20=\"Gold\",4,IF(H20=\"Silver\",3,IF(H20=\"Bronze\",2,1)))))","v":{"$error":"#REF!"}},{"$f":"IF(COUNTIF(#REF!,\"Blank\")>0,\"Blank\",\"OK\")","v":{"$error":"#REF!"}}]
{"$rows_left_out":4}
{"sheet":"pull down list","index":4,"n_rows":19,"n_cols":42,"rows_kept":19,"cut":false,"hidden":true,"merged":[]}
["Defined Names","areat","ac","area","yn","prereq","prereq_b","sco_1","sco_1_b","sco_2","sco_2_b","sco_3","sco_3_b","sco_5","sco_5_b","sco_15","sco_15_b","sco_bon","sco_bon_b","sco_6","sco_6_b",null,"sco_1_a","sco_2_a","sco_3_a","sco_5_a","sco_15_a",0,null,"Assessment Tools",null,"project type",null,"rank",null,null,null,null,null,"If"]
[null,"Carpark ","Central A/C","Area A",null,"PR","PR","NA","NA","NA","NA","NA","NA","NA","NA","NA","NA","NA","NA","NA","NA",null,"NA","NA","NA","NA","NA","NA",null,null,null,null,null,{"$f":"'Summary (NB2.0)'!F29","v":"00:00:00"},{"$f":"'Summary (NB2.0)'!F30","v":"00:00:00"},{"$f":"RANK(AH2,$AH$2:$AI$4)","v":1},1,{"$f":"AJ2-AK2","v":0},null,{"$f":"'Summary (NB2.0)'!#REF!","v":{"$error":"#REF!"}},{"$f":"'Summary (NB2.0)'!#REF!","v":{"$error":"#REF!"}},{"$f":"IF(AND(AN2<>0,AO2>AN2),1,0)","v":{"$error":"#REF!"}}]
[null,"Clubhouse ","Chiller","Area B","Yes","NA","NA","NS","NS","NS","NS","NS","NS","NS","NS","NS","NS","NS","NS","NS","NS",null,1,2,3,5,15,6,null,"New Building Version 2.0",null,"Provisional Assessment (PA)",null,{"$f":"'Summary (NB2.0)'!F35","v":"00:00:00"},{"$f":"'Summary (NB2.0)'!F36","v":"00:00:00"},1,1,{"$f":"AJ3-AK3","v":0},null,{"$f":"'Summary (NB2.0)'!#REF!","v":{"$error":"#REF!"}},{"$f":"'Summary (NB2.0)'!#REF!","v":{"$error":"#REF!"}},{"$f":"IF(AND(AN3<>0,AO3>AN3),1,0)","v":{"$error":"#REF!"}}]
[null,"Educational","Mechnical Vent","Area C","No",null,0,1,1,2,2,3,3,5,5,15,15,"1B","1B",6,6,null,null,1,2,4,14,5,null,null,null,"Preliminary Final Assessment (PFA)",null,{"$f":"'Summary (NB2.0)'!F41","v":"00:00:00"},{"$f":"'Summary (NB2.0)'!F42","v":"00:00:00"},1,1,0,null,{"$f":"'Summary (NB2.0)'!#REF!","v":{"$error":"#REF!"}},{"$f":"'Summary (NB2.0)'!#REF!","v":{"$error":"#REF!"}},{"$error":"#REF!"}]
[null,"Hotel","Split Type A/C","Area D",null,null,null,null,0,1,1,2,2,4,4,14,14,null,0,5,5,null,null,null,1,3,13,4,null,null,null,"Final Assessment (FA)",null,null,null,null,null,{"$f":"SUM(AL2:AL4)","v":0},null,{"$f":"'Summary (NB2.0)'!#REF!","v":{"$error":"#REF!"}},{"$f":"'Summary (NB2.0)'!#REF!","v":{"$error":"#REF!"}},{"$error":"#REF!"}]
[null,"Industrial","VRV",null,null,null,null,null,null,null,0,1,1,3,3,13,13,null,null,4,4,null,null,null,null,2,12,3,null,null,null,null,null,null,null,null,null,null,null,null,null,{"$f":"SUM(AP2:AP5)","v":{"$error":"#REF!"}}]
[null,"Residential","Windows Type A/C",null,null,null,null,null,null,null,null,null,0,2,2,12,12,null,null,3,3,null,null,null,null,1,11,2]
[null,"Retail","VRV & fresh air",null,null,null,null,null,null,null,null,null,null,1,1,11,11,null,null,2,2,null,null,null,null,null,10,1]
[null,null,"To be provided by future tenant",null,null,null,null,null,null,null,null,null,null,null,0,10,10,null,null,1,1,null,null,null,null,null,9]
[null,null,null,null,null,null,null,null,null,null,null,null,null,null,null,9,9,null,null,null,0,null,null,null,null,null,8]
[null,null,null,null,null,null,null,null,null,null,null,null,null,null,null,8,8,null,null,null,null,null,null,null,null,null,7]
[null,null,null,null,null,null,null,null,null,null,null,null,null,null,null,7,7,null,null,null,null,null,null,null,null,null,6]
[null,null,null,null,null,null,null,null,null,null,null,null,null,null,null,6,6,null,null,null,null,null,null,null,null,null,5]
[null,null,null,null,null,null,null,null,null,null,null,null,null,null,null,5,5,null,null,null,null,null,null,null,null,null,4]
[null,null,null,null,null,null,null,null,null,null,null,null,null,null,null,4,4,null,null,null,null,null,null,null,null,null,3]
[null,null,null,null,null,null,null,null,null,null,null,null,null,null,null,3,3,null,null,null,null,null,null,null,null,null,2]
[null,null,null,null,null,null,null,null,null,null,null,null,null,null,null,2,2,null,null,null,null,null,null,null,null,null,1]
[null,null,null,null,null,null,null,null,null,null,null,null,null,null,null,1,1]
[null,null,null,null,null,null,null,null,null,null,null,null,null,null,null,null,0]